> Tous les forums > Forum Linux
 probléme d'installation de ns-allinone-2.31
Ajouter un message à la discussion
Page : [1] 
Page 1 sur 1
yannbo
  Posté le 04/09/2007 @ 12:27 
Aller en bas de la page 
Petit astucien

bonsoir a tous
je viens de télécharger le logiciel de simulation network simulator je l'ai décompressé et j'ai essayé de l'installé par ./install
mais il me renvoi des messages d'erreur lié au script Tcl:
/usr/src/ns-allinone-2.31/tk8.4.14/generic/tk3d.c:135: error: erreur de syntaxe before ')' token
/usr/src/ns-allinone-2.31/tk8.4.14/generic/tk3d.c:139: error: erreur de syntaxe before ')' token
/usr/src/ns-allinone-2.31/tk8.4.14/generic/tk3d.c:139: error: erreur de syntaxe before ')' token
/usr/src/ns-allinone-2.31/tk8.4.14/generic/tk3d.c:140: error: erreur de syntaxe before ')' token
/usr/src/ns-allinone-2.31/tk8.4.14/generic/tk3d.c:153: error: erreur de syntaxe before ')' token
/usr/src/ns-allinone-2.31/tk8.4.14/generic/tk3d.c: Dans la fonction « Tk_Get3DBo rder »:
/usr/src/ns-allinone-2.31/tk8.4.14/generic/tk3d.c:193: error: `borderPtr' undecl ared (first use in this function)
/usr/src/ns-allinone-2.31/tk8.4.14/generic/tk3d.c:193: error: `existingBorderPtr ' undeclared (first use in this function)
/usr/src/ns-allinone-2.31/tk8.4.14/generic/tk3d.c:193: attention : left-hand ope rand of comma expression has no effect
/usr/src/ns-allinone-2.31/tk8.4.14/generic/tk3d.c:195: error: `XGCValues' undecl ared (first use in this function)
/usr/src/ns-allinone-2.31/tk8.4.14/generic/tk3d.c:195: error: erreur de syntaxe before "gcValues"
/usr/src/ns-allinone-2.31/tk8.4.14/generic/tk3d.c:196: error: `XColor' undeclare d (first use in this function)
/usr/src/ns-allinone-2.31/tk8.4.14/generic/tk3d.c:197: error: invalid operands t o binary *
/usr/src/ns-allinone-2.31/tk8.4.14/generic/tk3d.c:199: error: erreur de syntaxe before ')' token
/usr/src/ns-allinone-2.31/tk8.4.14/generic/tk3d.c:201: error: request for member `borderInit' in something not a structure or union
/usr/src/ns-allinone-2.31/tk8.4.14/generic/tk3d.c:205: error: request for member `borderTable' in something not a structure or union
/usr/src/ns-allinone-2.31/tk8.4.14/generic/tk3d.c:205: error: request for member `borderTable' in something not a structure or union
/usr/src/ns-allinone-2.31/tk8.4.14/generic/tk3d.c:207: error: erreur de syntaxe before ')' token
/usr/src/ns-allinone-2.31/tk8.4.14/generic/tk3d.c:210: error: erreur de syntaxe before ')' token
/usr/src/ns-allinone-2.31/tk8.4.14/generic/tk3d.c:210: error: erreur de syntaxe before ')' token
/usr/src/ns-allinone-2.31/tk8.4.14/generic/tk3d.c:211: error: erreur de syntaxe before ')' token
/usr/src/ns-allinone-2.31/tk8.4.14/generic/tk3d.c:233: error: erreur de syntaxe before ')' token
/usr/src/ns-allinone-2.31/tk8.4.14/generic/tk3d.c:233: error: erreur de syntaxe before ')' token
/usr/src/ns-allinone-2.31/tk8.4.14/generic/tk3d.c:234: error: erreur de syntaxe before ')' token
/usr/src/ns-allinone-2.31/tk8.4.14/generic/tk3d.c:235: error: erreur de syntaxe before ')' token
/usr/src/ns-allinone-2.31/tk8.4.14/generic/tk3d.c:236: error: erreur de syntaxe before ')' token
/usr/src/ns-allinone-2.31/tk8.4.14/generic/tk3d.c:242: error: `None' undeclared (first use in this function)
/usr/src/ns-allinone-2.31/tk8.4.14/generic/tk3d.c:256: error: `gcValues' undecla red (first use in this function)
/usr/src/ns-allinone-2.31/tk8.4.14/generic/tk3d.c:257: error: `GCForeground' und eclared (first use in this function)
/usr/src/ns-allinone-2.31/tk8.4.14/generic/tk3d.c: Dans la fonction « Tk_Draw3DR ectangle »:
/usr/src/ns-allinone-2.31/tk8.4.14/generic/tk3d.c:284: error: erreur de syntaxe before "Drawable"
/usr/src/ns-allinone-2.31/tk8.4.14/generic/tk3d.c: Dans la fonction « Tk_NameOf3 DBorder »:
/usr/src/ns-allinone-2.31/tk8.4.14/generic/tk3d.c:331: error: `borderPtr' undecl ared (first use in this function)
/usr/src/ns-allinone-2.31/tk8.4.14/generic/tk3d.c:331: error: erreur de syntaxe before ')' token
/usr/src/ns-allinone-2.31/tk8.4.14/generic/tk3d.c: Hors de toute fonction :
/usr/src/ns-allinone-2.31/tk8.4.14/generic/tk3d.c:352: error: erreur de syntaxe before '*' token
/usr/src/ns-allinone-2.31/tk8.4.14/generic/tk3d.c:354: attention : return type d efaults to `int'
/usr/src/ns-allinone-2.31/tk8.4.14/generic/tk3d.c: Dans la fonction « Tk_3DBorde rColor »:
/usr/src/ns-allinone-2.31/tk8.4.14/generic/tk3d.c:356: error: erreur de syntaxe before ')' token
/usr/src/ns-allinone-2.31/tk8.4.14/generic/tk3d.c: Hors de toute fonction :
/usr/src/ns-allinone-2.31/tk8.4.14/generic/tk3d.c:376: error: erreur de syntaxe before "Tk_3DBorderGC"
/usr/src/ns-allinone-2.31/tk8.4.14/generic/tk3d.c:377: attention : return type d efaults to `int'
/usr/src/ns-allinone-2.31/tk8.4.14/generic/tk3d.c: Dans la fonction « Tk_3DBorde rGC »:
/usr/src/ns-allinone-2.31/tk8.4.14/generic/tk3d.c:383: error: `borderPtr' undecl ared (first use in this function)
/usr/src/ns-allinone-2.31/tk8.4.14/generic/tk3d.c:383: error: erreur de syntaxe before ')' token
/usr/src/ns-allinone-2.31/tk8.4.14/generic/tk3d.c:385: error: `None' undeclared (first use in this function)
/usr/src/ns-allinone-2.31/tk8.4.14/generic/tk3d.c:402: error: erreur de syntaxe before "None"
/usr/src/ns-allinone-2.31/tk8.4.14/generic/tk3d.c: Dans la fonction « Tk_Free3DB order »:
/usr/src/ns-allinone-2.31/tk8.4.14/generic/tk3d.c:428: error: `borderPtr' undecl ared (first use in this function)
/usr/src/ns-allinone-2.31/tk8.4.14/generic/tk3d.c:428: error: erreur de syntaxe before ')' token
/usr/src/ns-allinone-2.31/tk8.4.14/generic/tk3d.c:429: error: `Display' undeclar ed (first use in this function)
/usr/src/ns-allinone-2.31/tk8.4.14/generic/tk3d.c:429: attention : implicit decl aration of function `DisplayOfScreen'
/usr/src/ns-allinone-2.31/tk8.4.14/generic/tk3d.c:430: error: `prevPtr' undeclar ed (first use in this function)
/usr/src/ns-allinone-2.31/tk8.4.14/generic/tk3d.c:437: error: erreur de syntaxe before ')' token
/usr/src/ns-allinone-2.31/tk8.4.14/generic/tk3d.c:448: error: `None' undeclared (first use in this function)
/usr/src/ns-allinone-2.31/tk8.4.14/generic/tk3d.c: Dans la fonction « FreeBorder ObjProc »:
/usr/src/ns-allinone-2.31/tk8.4.14/generic/tk3d.c:532: error: `borderPtr' undecl ared (first use in this function)
/usr/src/ns-allinone-2.31/tk8.4.14/generic/tk3d.c:532: error: erreur de syntaxe before ')' token
/usr/src/ns-allinone-2.31/tk8.4.14/generic/tk3d.c: Dans la fonction « DupBorderO bjProc »:
/usr/src/ns-allinone-2.31/tk8.4.14/generic/tk3d.c:567: error: `borderPtr' undecl ared (first use in this function)
/usr/src/ns-allinone-2.31/tk8.4.14/generic/tk3d.c:567: error: erreur de syntaxe before ')' token
/usr/src/ns-allinone-2.31/tk8.4.14/generic/tk3d.c: Dans la fonction « Tk_SetBack groundFromBorder »:
/usr/src/ns-allinone-2.31/tk8.4.14/generic/tk3d.c:599: error: erreur de syntaxe before '*' token
/usr/src/ns-allinone-2.31/tk8.4.14/generic/tk3d.c:601: error: `borderPtr' undecl ared (first use in this function)
/usr/src/ns-allinone-2.31/tk8.4.14/generic/tk3d.c: Dans la fonction « Tk_Draw3DP olygon »:
/usr/src/ns-allinone-2.31/tk8.4.14/generic/tk3d.c:755: error: erreur de syntaxe before "Drawable"
/usr/src/ns-allinone-2.31/tk8.4.14/generic/tk3d.c:757: error: erreur de syntaxe before "XPoint"
/usr/src/ns-allinone-2.31/tk8.4.14/generic/tk3d.c:769: error: `XPoint' undeclare d (first use in this function)
/usr/src/ns-allinone-2.31/tk8.4.14/generic/tk3d.c:769: error: erreur de syntaxe before "poly"
/usr/src/ns-allinone-2.31/tk8.4.14/generic/tk3d.c:771: error: erreur de syntaxe before '*' token
/usr/src/ns-allinone-2.31/tk8.4.14/generic/tk3d.c:772: error: `borderPtr' undecl ared (first use in this function)
/usr/src/ns-allinone-2.31/tk8.4.14/generic/tk3d.c:772: error: erreur de syntaxe before ')' token
/usr/src/ns-allinone-2.31/tk8.4.14/generic/tk3d.c:775: error: `Display' undeclar ed (first use in this function)
/usr/src/ns-allinone-2.31/tk8.4.14/generic/tk3d.c:775: error: erreur de syntaxe before ')' token
/usr/src/ns-allinone-2.31/tk8.4.14/generic/tk3d.c:777: error: `None' undeclared (first use in this function)
/usr/src/ns-allinone-2.31/tk8.4.14/generic/tk3d.c:803: error: `p1Ptr' undeclared (first use in this function)
/usr/src/ns-allinone-2.31/tk8.4.14/generic/tk3d.c:803: error: subscripted value is neither array nor pointer
/usr/src/ns-allinone-2.31/tk8.4.14/generic/tk3d.c:804: error: `p2Ptr' undeclared (first use in this function)
/usr/src/ns-allinone-2.31/tk8.4.14/generic/tk3d.c:804: error: subscripted value is neither array nor pointer
/usr/src/ns-allinone-2.31/tk8.4.14/generic/tk3d.c:850: error: subscripted value is neither array nor pointer
/usr/src/ns-allinone-2.31/tk8.4.14/generic/tk3d.c:850: attention : left-hand ope rand of comma expression has no effect
/usr/src/ns-allinone-2.31/tk8.4.14/generic/tk3d.c:851: attention : left-hand ope rand of comma expression has no effect
/usr/src/ns-allinone-2.31/tk8.4.14/generic/tk3d.c:862: error: `newB1' undeclared (first use in this function)
/usr/src/ns-allinone-2.31/tk8.4.14/generic/tk3d.c:863: error: `newB2' undeclared (first use in this function)
/usr/src/ns-allinone-2.31/tk8.4.14/generic/tk3d.c:865: error: `poly' undeclared (first use in this function)
/usr/src/ns-allinone-2.31/tk8.4.14/generic/tk3d.c:868: error: `b1' undeclared (f irst use in this function)
/usr/src/ns-allinone-2.31/tk8.4.14/generic/tk3d.c:868: error: `b2' undeclared (f irst use in this function)
/usr/src/ns-allinone-2.31/tk8.4.14/generic/tk3d.c:900: error: `perp' undeclared (first use in this function)
/usr/src/ns-allinone-2.31/tk8.4.14/generic/tk3d.c:903: error: `c' undeclared (fi rst use in this function)
/usr/src/ns-allinone-2.31/tk8.4.14/generic/tk3d.c:904: error: `shift1' undeclare d (first use in this function)
/usr/src/ns-allinone-2.31/tk8.4.14/generic/tk3d.c:905: error: `shift2' undeclare d (first use in this function)
/usr/src/ns-allinone-2.31/tk8.4.14/generic/tk3d.c:919: error: `gc' undeclared (f irst use in this function)
/usr/src/ns-allinone-2.31/tk8.4.14/generic/tk3d.c:923: attention : implicit decl aration of function `XFillPolygon'
/usr/src/ns-allinone-2.31/tk8.4.14/generic/tk3d.c:923: error: `Convex' undeclare d (first use in this function)
/usr/src/ns-allinone-2.31/tk8.4.14/generic/tk3d.c:924: error: `CoordModeOrigin' undeclared (first use in this function)
/usr/src/ns-allinone-2.31/tk8.4.14/generic/tk3d.c:850: attention : value compute d is not used
/usr/src/ns-allinone-2.31/tk8.4.14/generic/tk3d.c:850: attention : value compute d is not used
/usr/src/ns-allinone-2.31/tk8.4.14/generic/tk3d.c: Dans la fonction « Tk_Fill3DR ectangle »:
/usr/src/ns-allinone-2.31/tk8.4.14/generic/tk3d.c:963: error: erreur de syntaxe before "Drawable"
/usr/src/ns-allinone-2.31/tk8.4.14/generic/tk3d.c:971: error: erreur de syntaxe before '*' token
/usr/src/ns-allinone-2.31/tk8.4.14/generic/tk3d.c:997: attention : implicit decl aration of function `XFillRectangle'
/usr/src/ns-allinone-2.31/tk8.4.14/generic/tk3d.c:997: error: erreur de syntaxe before ')' token
/usr/src/ns-allinone-2.31/tk8.4.14/generic/tk3d.c:997: error: `borderPtr' undecl ared (first use in this function)
/usr/src/ns-allinone-2.31/tk8.4.14/generic/tk3d.c: Dans la fonction « Tk_Fill3DP olygon »:
/usr/src/ns-allinone-2.31/tk8.4.14/generic/tk3d.c:1028: error: erreur de syntaxe before "Drawable"
/usr/src/ns-allinone-2.31/tk8.4.14/generic/tk3d.c:1030: error: erreur de syntaxe before "XPoint"
/usr/src/ns-allinone-2.31/tk8.4.14/generic/tk3d.c:1042: error: erreur de syntaxe before '*' token
/usr/src/ns-allinone-2.31/tk8.4.14/generic/tk3d.c:1044: error: erreur de syntaxe before ')' token
/usr/src/ns-allinone-2.31/tk8.4.14/generic/tk3d.c:1044: error: `borderPtr' undec lared (first use in this function)
/usr/src/ns-allinone-2.31/tk8.4.14/generic/tk3d.c:1045: error: `Complex' undecla red (first use in this function)
/usr/src/ns-allinone-2.31/tk8.4.14/generic/tk3d.c:1045: error: `CoordModeOrigin' undeclared (first use in this function)
/usr/src/ns-allinone-2.31/tk8.4.14/generic/tk3d.c: Hors de toute fonction :
/usr/src/ns-allinone-2.31/tk8.4.14/generic/tk3d.c:1070: error: erreur de syntaxe before "TkDisplay"
/usr/src/ns-allinone-2.31/tk8.4.14/generic/tk3d.c:1070: attention : data definit ion has no type or storage class
/usr/src/ns-allinone-2.31/tk8.4.14/generic/tk3d.c:1071: error: erreur de syntaxe before '{' token
/usr/src/ns-allinone-2.31/tk8.4.14/generic/tk3d.c:1073: error: erreur de syntaxe before '&' token
/usr/src/ns-allinone-2.31/tk8.4.14/generic/tk3d.c:1073: error: conflicting types for `Tcl_InitHashTable'
/usr/src/ns-allinone-2.31/tcl8.4.14/generic/tclDecls.h:595: error: previous decl aration of `Tcl_InitHashTable'
/usr/src/ns-allinone-2.31/tk8.4.14/generic/tk3d.c:1073: attention : data definit ion has no type or storage class
/usr/src/ns-allinone-2.31/tk8.4.14/generic/tk3d.c:1096: error: erreur de syntaxe before "XPoint"
/usr/src/ns-allinone-2.31/tk8.4.14/generic/tk3d.c:1096: error: `p1Ptr' used prio r to declaration
/usr/src/ns-allinone-2.31/tk8.4.14/generic/tk3d.c:1096: attention : data definit ion has no type or storage class
/usr/src/ns-allinone-2.31/tk8.4.14/generic/tk3d.c:1097: error: erreur de syntaxe before '*' token
/usr/src/ns-allinone-2.31/tk8.4.14/generic/tk3d.c:1097: error: `p2Ptr' used prio r to declaration
/usr/src/ns-allinone-2.31/tk8.4.14/generic/tk3d.c:1097: attention : data definit ion has no type or storage class
/usr/src/ns-allinone-2.31/tk8.4.14/generic/tk3d.c:1102: error: erreur de syntaxe before '*' token
/usr/src/ns-allinone-2.31/tk8.4.14/generic/tk3d.c:1102: attention : data definit ion has no type or storage class
/usr/src/ns-allinone-2.31/tk8.4.14/generic/tk3d.c:1104: error: erreur de syntaxe before '{' token
/usr/src/ns-allinone-2.31/tk8.4.14/generic/tk3d.c:1127: error: erreur de syntaxe before "if"
/usr/src/ns-allinone-2.31/tk8.4.14/generic/tk3d.c:1131: error: erreur de syntaxe before "for"
/usr/src/ns-allinone-2.31/tk8.4.14/generic/tk3d.c:1133: error: conflicting types for `cosine'

/usr/src/ns-allinone-2.31/tk8.4.14/generic/tk3d.c:1129: error: previous declarat ion of `cosine'
/usr/src/ns-allinone-2.31/tk8.4.14/generic/tk3d.c:1133: attention : data definit ion has no type or storage class
/usr/src/ns-allinone-2.31/tk8.4.14/generic/tk3d.c:1134: error: `i' undeclared he re (not in a function)
/usr/src/ns-allinone-2.31/tk8.4.14/generic/tk3d.c:1134: error: conflicting types for `shiftTable'
/usr/src/ns-allinone-2.31/tk8.4.14/generic/tk3d.c:1120: error: previous declarat ion of `shiftTable'
/usr/src/ns-allinone-2.31/tk8.4.14/generic/tk3d.c:1134: attention : data definit ion has no type or storage class
/usr/src/ns-allinone-2.31/tk8.4.14/generic/tk3d.c:1135: error: erreur de syntaxe before '}' token
/usr/src/ns-allinone-2.31/tk8.4.14/generic/tk3d.c:1138: attention : initialisati on transforme un entier en pointeur sans transtypage
/usr/src/ns-allinone-2.31/tk8.4.14/generic/tk3d.c:1138: error: un élément de l'i nitialisation n'est pas une constante
/usr/src/ns-allinone-2.31/tk8.4.14/generic/tk3d.c:1138: attention : data definit ion has no type or storage class
/usr/src/ns-allinone-2.31/tk8.4.14/generic/tk3d.c:1139: error: request for membe r `x' in something not a structure or union
/usr/src/ns-allinone-2.31/tk8.4.14/generic/tk3d.c:1139: error: request for membe r `x' in something not a structure or union
/usr/src/ns-allinone-2.31/tk8.4.14/generic/tk3d.c:1139: attention : data definit ion has no type or storage class
/usr/src/ns-allinone-2.31/tk8.4.14/generic/tk3d.c:1140: error: request for membe r `y' in something not a structure or union
/usr/src/ns-allinone-2.31/tk8.4.14/generic/tk3d.c:1140: error: request for membe r `y' in something not a structure or union
/usr/src/ns-allinone-2.31/tk8.4.14/generic/tk3d.c:1140: attention : data definit ion has no type or storage class
/usr/src/ns-allinone-2.31/tk8.4.14/generic/tk3d.c:1141: error: erreur de syntaxe before "if"
/usr/src/ns-allinone-2.31/tk8.4.14/generic/tk3d.c:1143: error: redefinition of ` dy'
/usr/src/ns-allinone-2.31/tk8.4.14/generic/tk3d.c:1140: error: `dy' previously d efined here
/usr/src/ns-allinone-2.31/tk8.4.14/generic/tk3d.c:1143: error: un élément de l'i nitialisation n'est pas une constante
/usr/src/ns-allinone-2.31/tk8.4.14/generic/tk3d.c:1143: attention : data definit ion has no type or storage class
/usr/src/ns-allinone-2.31/tk8.4.14/generic/tk3d.c:1144: error: erreur de syntaxe before '}' token
/usr/src/ns-allinone-2.31/tk8.4.14/generic/tk3d.c:1149: error: redefinition of ` dx'
/usr/src/ns-allinone-2.31/tk8.4.14/generic/tk3d.c:1139: error: `dx' previously d efined here
/usr/src/ns-allinone-2.31/tk8.4.14/generic/tk3d.c:1149: error: un élément de l'i nitialisation n'est pas une constante
/usr/src/ns-allinone-2.31/tk8.4.14/generic/tk3d.c:1149: attention : data definit ion has no type or storage class
/usr/src/ns-allinone-2.31/tk8.4.14/generic/tk3d.c:1150: error: erreur de syntaxe before '}' token
/usr/src/ns-allinone-2.31/tk8.4.14/generic/tk3d.c:1189: error: erreur de syntaxe before "XPoint"

/usr/src/ns-allinone-2.31/tk8.4.14/generic/tk3d.c:1189: attention : data definit ion has no type or storage class
/usr/src/ns-allinone-2.31/tk8.4.14/generic/tk3d.c:1190: error: erreur de syntaxe before '*' token
/usr/src/ns-allinone-2.31/tk8.4.14/generic/tk3d.c:1190: attention : data definit ion has no type or storage class
/usr/src/ns-allinone-2.31/tk8.4.14/generic/tk3d.c:1191: error: erreur de syntaxe before '*' token
/usr/src/ns-allinone-2.31/tk8.4.14/generic/tk3d.c:1191: attention : data definit ion has no type or storage class
/usr/src/ns-allinone-2.31/tk8.4.14/generic/tk3d.c:1192: error: erreur de syntaxe before '*' token
/usr/src/ns-allinone-2.31/tk8.4.14/generic/tk3d.c:1192: attention : data definit ion has no type or storage class
/usr/src/ns-allinone-2.31/tk8.4.14/generic/tk3d.c:1193: error: erreur de syntaxe before '*' token
/usr/src/ns-allinone-2.31/tk8.4.14/generic/tk3d.c:1193: attention : data definit ion has no type or storage class
/usr/src/ns-allinone-2.31/tk8.4.14/generic/tk3d.c:1194: error: erreur de syntaxe before '{' token
/usr/src/ns-allinone-2.31/tk8.4.14/generic/tk3d.c:1203: error: request for membe r `x' in something not a structure or union
/usr/src/ns-allinone-2.31/tk8.4.14/generic/tk3d.c:1203: error: request for membe r `x' in something not a structure or union
/usr/src/ns-allinone-2.31/tk8.4.14/generic/tk3d.c:1203: error: request for membe r `y' in something not a structure or union
/usr/src/ns-allinone-2.31/tk8.4.14/generic/tk3d.c:1203: error: request for membe r `y' in something not a structure or union
/usr/src/ns-allinone-2.31/tk8.4.14/generic/tk3d.c:1203: attention : data definit ion has no type or storage class
/usr/src/ns-allinone-2.31/tk8.4.14/generic/tk3d.c:1204: error: request for membe r `x' in something not a structure or union
/usr/src/ns-allinone-2.31/tk8.4.14/generic/tk3d.c:1204: error: request for membe r `x' in something not a structure or union
/usr/src/ns-allinone-2.31/tk8.4.14/generic/tk3d.c:1204: error: request for membe r `y' in something not a structure or union
/usr/src/ns-allinone-2.31/tk8.4.14/generic/tk3d.c:1204: error: request for membe r `y' in something not a structure or union
/usr/src/ns-allinone-2.31/tk8.4.14/generic/tk3d.c:1204: attention : data definit ion has no type or storage class
/usr/src/ns-allinone-2.31/tk8.4.14/generic/tk3d.c:1205: error: request for membe r `x' in something not a structure or union
/usr/src/ns-allinone-2.31/tk8.4.14/generic/tk3d.c:1205: error: request for membe r `x' in something not a structure or union
/usr/src/ns-allinone-2.31/tk8.4.14/generic/tk3d.c:1205: error: request for membe r `x' in something not a structure or union
/usr/src/ns-allinone-2.31/tk8.4.14/generic/tk3d.c:1205: error: request for membe r `x' in something not a structure or union
/usr/src/ns-allinone-2.31/tk8.4.14/generic/tk3d.c:1205: attention : data definit ion has no type or storage class
/usr/src/ns-allinone-2.31/tk8.4.14/generic/tk3d.c:1206: error: request for membe r `y' in something not a structure or union
/usr/src/ns-allinone-2.31/tk8.4.14/generic/tk3d.c:1206: error: request for membe r `y' in something not a structure or union
/usr/src/ns-allinone-2.31/tk8.4.14/generic/tk3d.c:1206: error: request for membe r `y' in something not a structure or union
/usr/src/ns-allinone-2.31/tk8.4.14/generic/tk3d.c:1206: error: request for membe r `y' in something not a structure or union
/usr/src/ns-allinone-2.31/tk8.4.14/generic/tk3d.c:1206: attention : data definit ion has no type or storage class
/usr/src/ns-allinone-2.31/tk8.4.14/generic/tk3d.c:1208: error: erreur de syntaxe before "if"
/usr/src/ns-allinone-2.31/tk8.4.14/generic/tk3d.c:1211: error: request for membe r `x' in something not a structure or union
/usr/src/ns-allinone-2.31/tk8.4.14/generic/tk3d.c:1211: error: request for membe r `x' in something not a structure or union
/usr/src/ns-allinone-2.31/tk8.4.14/generic/tk3d.c:1211: error: request for membe r `y' in something not a structure or union
/usr/src/ns-allinone-2.31/tk8.4.14/generic/tk3d.c:1211: error: request for membe r `y' in something not a structure or union
/usr/src/ns-allinone-2.31/tk8.4.14/generic/tk3d.c:1211: attention : data definit ion has no type or storage class
/usr/src/ns-allinone-2.31/tk8.4.14/generic/tk3d.c:1212: error: un élément de l'i nitialisation n'est pas une constante
/usr/src/ns-allinone-2.31/tk8.4.14/generic/tk3d.c:1212: attention : data definit ion has no type or storage class
/usr/src/ns-allinone-2.31/tk8.4.14/generic/tk3d.c:1213: error: erreur de syntaxe before "if"
/usr/src/ns-allinone-2.31/tk8.4.14/generic/tk3d.c:1215: error: redefinition of ` q'
/usr/src/ns-allinone-2.31/tk8.4.14/generic/tk3d.c:1212: error: `q' previously de fined here
/usr/src/ns-allinone-2.31/tk8.4.14/generic/tk3d.c:1215: error: un élément de l'i nitialisation n'est pas une constante
/usr/src/ns-allinone-2.31/tk8.4.14/generic/tk3d.c:1215: attention : data definit ion has no type or storage class
/usr/src/ns-allinone-2.31/tk8.4.14/generic/tk3d.c:1216: error: erreur de syntaxe before '}' token
/usr/src/ns-allinone-2.31/tk8.4.14/generic/tk3d.c:1222: error: redefinition of ` p'
/usr/src/ns-allinone-2.31/tk8.4.14/generic/tk3d.c:1211: error: `p' previously de fined here
/usr/src/ns-allinone-2.31/tk8.4.14/generic/tk3d.c:1222: error: request for membe r `y' in something not a structure or union
/usr/src/ns-allinone-2.31/tk8.4.14/generic/tk3d.c:1222: error: request for membe r `y' in something not a structure or union
/usr/src/ns-allinone-2.31/tk8.4.14/generic/tk3d.c:1222: error: request for membe r `x' in something not a structure or union
/usr/src/ns-allinone-2.31/tk8.4.14/generic/tk3d.c:1222: error: request for membe r `x' in something not a structure or union
/usr/src/ns-allinone-2.31/tk8.4.14/generic/tk3d.c:1222: attention : data definit ion has no type or storage class
/usr/src/ns-allinone-2.31/tk8.4.14/generic/tk3d.c:1223: error: redefinition of ` q'
/usr/src/ns-allinone-2.31/tk8.4.14/generic/tk3d.c:1215: error: `q' previously de fined here
/usr/src/ns-allinone-2.31/tk8.4.14/generic/tk3d.c:1223: error: un élément de l'i nitialisation n'est pas une constante
/usr/src/ns-allinone-2.31/tk8.4.14/generic/tk3d.c:1223: attention : data definit ion has no type or storage class
/usr/src/ns-allinone-2.31/tk8.4.14/generic/tk3d.c:1224: error: erreur de syntaxe before "if"
/usr/src/ns-allinone-2.31/tk8.4.14/generic/tk3d.c:1226: error: redefinition of ` q'
/usr/src/ns-allinone-2.31/tk8.4.14/generic/tk3d.c:1223: error: `q' previously de fined here
/usr/src/ns-allinone-2.31/tk8.4.14/generic/tk3d.c:1226: error: un élément de l'i nitialisation n'est pas une constante
/usr/src/ns-allinone-2.31/tk8.4.14/generic/tk3d.c:1226: attention : data definit ion has no type or storage class
/usr/src/ns-allinone-2.31/tk8.4.14/generic/tk3d.c:1227: error: erreur de syntaxe before '}' token
/usr/src/ns-allinone-2.31/tk8.4.14/generic/tk3d.c: Dans la fonction « Tk_Get3DBo rderFromObj »:
/usr/src/ns-allinone-2.31/tk8.4.14/generic/tk3d.c:1262: error: `borderPtr' undec lared (first use in this function)
/usr/src/ns-allinone-2.31/tk8.4.14/generic/tk3d.c:1264: error: invalid operands to binary *
/usr/src/ns-allinone-2.31/tk8.4.14/generic/tk3d.c:1264: error: erreur de syntaxe before ')' token
/usr/src/ns-allinone-2.31/tk8.4.14/generic/tk3d.c:1277: error: erreur de syntaxe before ')' token
/usr/src/ns-allinone-2.31/tk8.4.14/generic/tk3d.c:1280: error: erreur de syntaxe before ')' token
/usr/src/ns-allinone-2.31/tk8.4.14/generic/tk3d.c:1280: error: erreur de syntaxe before ')' token
/usr/src/ns-allinone-2.31/tk8.4.14/generic/tk3d.c:1281: error: erreur de syntaxe before ')' token
/usr/src/ns-allinone-2.31/tk8.4.14/generic/tk3d.c:1301: error: request for membe r `borderTable' in something not a structure or union
/usr/src/ns-allinone-2.31/tk8.4.14/generic/tk3d.c:1301: error: request for membe r `borderTable' in something not a structure or union
/usr/src/ns-allinone-2.31/tk8.4.14/generic/tk3d.c:1305: error: erreur de syntaxe before ')' token
/usr/src/ns-allinone-2.31/tk8.4.14/generic/tk3d.c:1307: error: erreur de syntaxe before ')' token
/usr/src/ns-allinone-2.31/tk8.4.14/generic/tk3d.c:1307: error: erreur de syntaxe before ')' token
/usr/src/ns-allinone-2.31/tk8.4.14/generic/tk3d.c:1308: error: erreur de syntaxe before ')' token
/usr/src/ns-allinone-2.31/tk8.4.14/generic/tk3d.c: Dans la fonction « TkDebugBor der »:
/usr/src/ns-allinone-2.31/tk8.4.14/generic/tk3d.c:1388: error: `borderPtr' undec lared (first use in this function)
/usr/src/ns-allinone-2.31/tk8.4.14/generic/tk3d.c:1391: error: invalid operands to binary *
/usr/src/ns-allinone-2.31/tk8.4.14/generic/tk3d.c:1391: error: erreur de syntaxe before ')' token
/usr/src/ns-allinone-2.31/tk8.4.14/generic/tk3d.c:1394: error: request for membe r `borderTable' in something not a structure or union
/usr/src/ns-allinone-2.31/tk8.4.14/generic/tk3d.c:1394: error: request for membe r `borderTable' in something not a structure or union
/usr/src/ns-allinone-2.31/tk8.4.14/generic/tk3d.c:1396: error: erreur de syntaxe before ')' token
/usr/src/ns-allinone-2.31/tk8.4.14/generic/tk3d.c: Hors de toute fonction :
/usr/src/ns-allinone-2.31/tk8.4.14/generic/tk3d.c:1134: error: storage size of ` shiftTable' isn't known
/usr/src/ns-allinone-2.31/tk8.4.14/generic/tk3d.c:31: attention : `BorderInit' d eclared `static' but never defined
/usr/src/ns-allinone-2.31/tk8.4.14/generic/tk3d.c:35: attention : `Intersect' de clared `static' but never defined
/usr/src/ns-allinone-2.31/tk8.4.14/generic/tk3d.c:38: attention : `ShiftLine' de clared `static' but never defined
{entrée standard}: Messages de l'assembleur:
{entrée standard}:702: ERREUR: symbole « dy » est déjà défini
{entrée standard}:708: ERREUR: symbole « dx » est déjà défini
{entrée standard}:755: ERREUR: symbole « q » est déjà défini
{entrée standard}:761: ERREUR: symbole « p » est déjà défini
{entrée standard}:767: ERREUR: symbole « q » est déjà défini
{entrée standard}:773: ERREUR: symbole « q » est déjà défini
make: *** [tk3d.o] Erreur 1
tk8.4.14 make failed! Exiting ...
For problems with Tcl/Tk see http://www.scriptics.com
quelqu'un pourrait m'aidé

merci d'avance

Publicité
Page : [1] 
Page 1 sur 1

Vous devez être connecté pour participer à la discussion.
Cliquez ici pour vous identifier.

Vous n'avez pas de compte ? Créez-en un gratuitement !
Recevoir PC Astuces par e-mail


La Lettre quotidienne +226 000 inscrits
Avec l'actu, des logiciels, des applis, des astuces, des bons plans, ...

Les bonnes affaires
Une fois par semaine, un récap des meilleurs offres.

Les fonds d'écran
De jolies photos pour personnaliser votre bureau. Une fois par semaine.

Les nouveaux Bons Plans
Des notifications pour ne pas rater les bons plans publiés sur le site.

Les bons plans du moment PC Astuces

Tous les Bons Plans
Clavier mécanique Corsair K63 à 49,99 €
49,99 € 80 € -38% @RueDuCommerce
Jeu PC Star Wars Squadrons gratuit
0 € 39,99 € -100% @Epic Games
Microsoft Office 365 Famille (6 utilisateurs, PC/Mac/Android/iOS) pendant 27 mois à 92,99 €
92,99 € 198 € -53% @Amazon
Clé USB 3.2 SanDisk Extreme Pro 256 Go (420 Mo/s) à 51,74 €
51,74 € 75 € -31% @Amazon
Kit évolution PC : AMD Ryzen 7 5800X + carte mère B550 AORUS Elite V2 à 379,90 €
379,90 € 420 € -10% @RueDuCommerce
Ecran 27 pouces incurvé KTC H27S17 (QHD, 165 Hz, 1 ms, HDR10) à 219,76 € (+ mini enceinte Tronsmart Trip 10W étanche IPX7 offerte)
219,76 € 300 € -27% @Geekbuying
PC Portable Asus Zenbook 14 pouces (Ryzen 5 5600H, FullHD, 16Go, SSD 512Go, Vega 7) à 699,99 €
699,99 € 800 € -13% @RueDuCommerce
Souffleur sans fil Bosch Professionnal 18V GBL-120 à 47,07 €
47,07 € 77 € -39% @Amazon
PC Portable 16 pouces HP Victus (FHD, Intel Core i5-11400H, 8Go/512Go, RTX 3060 6 Go, Win11) à 799 €
799,00 € 999 € -20% @Amazon
Liseuse Amazon Kindle Paperwhite 6.8 pouces avec éclairage chaud réglable à 89,99 € (+15,75 € reversés)
89,99 € 139,99 € -36% @Rakuten

Sujets relatifs
Problème son qui grésille depuis installation nouveau kernel Debian
Probleme sur installation de trine 2
Problème installation linux
Problème Installation d'un système Linux
Problème installation Mafia II sous PlayOnLinux
problème installation imprimante DCP195C
Probléme lors de l'installation
problème installation logiciels sous xfce
Problème installation GRUB Suse Linux
problème installation UBUNTU
Plus de sujets relatifs à probléme d''installation de ns-allinone-2.31
 > Tous les forums > Forum Linux